Reaction Details
TargetLactase/phlorizin hydrolase
LigandBDBM50241865
Substrate/Competitorn/a
Meas. Tech.ChEMBL_639190 (CHEMBL1168043)
IC50 7200±n/a nM
Citation Kato, AYamashita, YNakagawa, SKoike, YAdachi, IHollinshead, JNash, RJIkeda, KAsano, N 2,5-Dideoxy-2,5-imino-d-altritol as a new class of pharmacological chaperone for Fabry disease. Bioorg Med Chem18:3790-4 (2010) 
 
Lactase/phlorizin hydrolase
Name:Lactase/phlorizin hydrolase
Type:PROTEIN
Mol. Mass.:217253.31
Organism:Rattus norvegicus
Description:ChEMBL_96426
Residue:1928
BDBM50241865
NameBDBM50241865
Synonyms:2,5-dideoxy-2,5-imino-D-altritol CHEMBL469844
TypeSmall organic molecule
Emp. Form.C6H13NO4
Mol. Mass.163.1717
SMILESOC[C@H]1N[C@H](CO)[C@H](O)[C@@H]1O