Reaction Details
TargetTyrosine-protein phosphatase non-receptor type 1
LigandBDBM50320947
Substrate/Competitorn/a
Meas. Tech.ChEMBL_638040 (CHEMBL1166943)
IC50 500±n/a nM
Citation Xu, JQShen, QLi, JHu, LH Dammaranes from Gynostemma pentaphyllum and synthesis of their derivatives as inhibitors of protein tyrosine phosphatase 1B. Bioorg Med Chem18:3934-9 (2010) 
 
Tyrosine-protein phosphatase non-receptor type 1
Name:Tyrosine-protein phosphatase non-receptor type 1
Type:Protein phosphatase
Mol. Mass.:49963.76
Organism:Homo sapiens (Human)
Description:Human recombinant GST-fusion PTP1B (1-435).
Residue:435
BDBM50320947
NameBDBM50320947
Synonyms:(3S,20S,23S)-3-(3'-Nitro-4'-carboxybenzoyloxy)-20,23-dihydroxydammar-24-en-21-oic acid-21,23-lactone | CHEMBL1163240
TypeSmall organic molecule
Emp. Form.C37H49NO9
Mol. Mass.651.7863
SMILES[#6]\[#6](-[#6])=[#6]\[#6@@H]-1-[#6][C@]([#8])([#6@H]-2-[#6]-[#6]-[#6@@H]3-[#6@@H]-2-[#6]-[#6]-[#6@H]2[C@@]3([#6])[#6]-[#6]-[#6@H]3C([#6])([#6])[#6@H](-[#6]-[#6][C@]23[#6])-[#8]-[#6](=O)-c2ccc(-[#6](-[#8])=O)c(c2)-[#7+](-[#8-])=O)[#6](=O)-[#8]1