Reaction Details
TargetHexokinase-4
LigandBDBM50321004
Substrate/Competitorn/a
Meas. Tech.ChEMBL_639395 (CHEMBL1167927)
EC50 26±n/a nM
Citation Li, FZhu, QZhang, YFeng, YLeng, YZhang, A Design, synthesis, and pharmacological evaluation of N-(4-mono and 4,5-disubstituted thiazol-2-yl)-2-aryl-3-(tetrahydro-2H-pyran-4-yl)propanamides as glucokinase activators. Bioorg Med Chem18:3875-84 (2010) 
 
Hexokinase-4
Name:Hexokinase-4
Type:Enzyme
Mol. Mass.:52175.81
Organism:Homo sapiens (Human)
Description:P35557
Residue:465
BDBM50321004
NameBDBM50321004
Synonyms:(R)-2-(4-(Cyclopropylsulfonyl)phenyl)-N-(4-isopropylthiazol-2-yl)-3-(tetrahydro-2H-pyran-4-yl)propanamide | CHEMBL1165653
TypeSmall organic molecule
Emp. Form.C23H30N2O4S2
Mol. Mass.462.625
SMILESCC(C)c1csc(NC(=O)[C@H](CC2CCOCC2)c2ccc(cc2)S(=O)(=O)C2CC2)n1