Reaction Details
Target3-hydroxy-3-methylglutaryl-coenzyme A reductase
LigandBDBM50321100
Substrate/Competitorn/a
Meas. Tech.ChEMBL_637423 (CHEMBL1166356)
Ki 260±n/a nM
Citation Pak, VVKoo, MKwon, DYShakhidoyatov, KMYun, L Peptide fragmentation as an approach in modeling of an active peptide and designing a competitive inhibitory peptide for HMG-CoA reductase. Bioorg Med Chem18:4300-9 (2010) 
 
3-hydroxy-3-methylglutaryl-coenzyme A reductase
Name:3-hydroxy-3-methylglutaryl-coenzyme A reductase
Type:Enzyme
Mol. Mass.:97477.10
Organism:Homo sapiens (Human)
Description:P04035
Residue:888
BDBM50321100
NameBDBM50321100
Synonyms:CHEMBL1164546 | GF(4-fluro)PTGG
TypeSmall organic molecule
Emp. Form.C24H33FN6O8
Mol. Mass.552.5526
SMILESC[C@@H](O)[C@H](NC(=O)[C@@H]1CCCN1C(=O)[C@H](Cc1ccc(F)cc1)NC(=O)CN)C(=O)NCC(=O)NCC(O)=O