Reaction Details
TargetThermolysin
LigandBDBM50321114
Substrate/Competitorn/a
Meas. Tech.ChEMBL_637433 (CHEMBL1166366)
IC50 54890±n/a nM
Citation Khan, MTKhan, RWuxiuer, YArfan, MAhmed, MSylte, I Identification of novel quinazolin-4(3H)-ones as inhibitors of thermolysin, the prototype of the M4 family of proteinases. Bioorg Med Chem18:4317-27 (2010) 
 
Thermolysin
Name:Thermolysin
Type:PROTEIN
Mol. Mass.:60097.54
Organism:Bacillus thermoproteolyticus
Description:ChEMBL_1468794
Residue:548
BDBM50321114
NameBDBM50321114
Synonyms:3-Amino-2-methylquinazolin-4(3H)-one | CHEMBL1163152
TypeSmall organic molecule
Emp. Form.C9H9N3O
Mol. Mass.175.1873
SMILESCc1nc2ccccc2c(=O)n1N