Reaction Details
TargetSodium/glucose cotransporter 2
LigandBDBM50321290
Substrate/Competitorn/a
Meas. Tech.ChEMBL_638420 (CHEMBL1167866)
IC50 1.2±n/a nM
Citation Xu, BFeng, YLv, BXu, GZhang, LDu, JPeng, KXu, MDong, JZhang, WZhang, TZhu, LDing, HSheng, ZWelihinda, ASeed, BChen, Y ortho-Substituted C-aryl glucosides as highly potent and selective renal sodium-dependent glucose co-transporter 2 (SGLT2) inhibitors. Bioorg Med Chem18:4422-32 (2010) 
 
Sodium/glucose cotransporter 2
Name:Sodium/glucose cotransporter 2
Type:Protein
Mol. Mass.:72902.00
Organism:Homo sapiens (Human)
Description:P31639
Residue:672
BDBM50321290
NameBDBM50321290
Synonyms:(2S,3R,4R,5S,6R)-2-(4-chloro-5-(4-ethylbenzyl)-2-((2-hydroxyethoxy)methyl)phenyl)-6-(hydroxymethyl)-tetrahydro-2H-pyran-3,4,5-triol | CHEMBL1165840
TypeSmall organic molecule
Emp. Form.C24H31ClO7
Mol. Mass.466.952
SMILESCCc1ccc(Cc2cc([C@@H]3O[C@H](CO)[C@@H](O)[C@H](O)[C@H]3O)c(COCCO)cc2Cl)cc1