Reaction Details
TargetAldo-keto reductase family 1 member B10
LigandBDBM50321716
Substrate/Competitorn/a
Meas. Tech.ChEMBL_640033 (CHEMBL1174247)
IC50 36±n/a nM
Citation Endo, SMatsunaga, TKuwata, KZhao, HTEl-Kabbani, OKitade, YHara, A Chromene-3-carboxamide derivatives discovered from virtual screening as potent inhibitors of the tumour maker, AKR1B10. Bioorg Med Chem18:2485-90 (2010) 
 
Aldo-keto reductase family 1 member B10
Name:Aldo-keto reductase family 1 member B10
Type:Protein
Mol. Mass.:36024.67
Organism:Homo sapiens (Human)
Description:O60218. 1ZUA; 4JII; 4GQ0
Residue:316
BDBM50321716
NameBDBM50321716
Synonyms:2-(3,4-dimethoxyphenylimino)-7-hydroxy-N-(6-methylpyridin-2-yl)-2H-chromene-3-carboxamide | CHEMBL1169757
TypeSmall organic molecule
Emp. Form.C24H21N3O5
Mol. Mass.431.4406
SMILESCOc1ccc(cc1OC)\N=c1/oc2cc(O)ccc2cc1C(=O)Nc1cccc(C)n1