Reaction Details
TargetAldo-keto reductase family 1 member B10
LigandBDBM50321717
Substrate/Competitorn/a
Meas. Tech.ChEMBL_640034 (CHEMBL1174248)
Ki 2.7±n/a nM
Citation Endo, SMatsunaga, TKuwata, KZhao, HTEl-Kabbani, OKitade, YHara, A Chromene-3-carboxamide derivatives discovered from virtual screening as potent inhibitors of the tumour maker, AKR1B10. Bioorg Med Chem18:2485-90 (2010) 
 
Aldo-keto reductase family 1 member B10
Name:Aldo-keto reductase family 1 member B10
Type:Protein
Mol. Mass.:36024.67
Organism:Homo sapiens (Human)
Description:O60218. 1ZUA; 4JII; 4GQ0
Residue:316
BDBM50321717
NameBDBM50321717
Synonyms:7-hydroxy-2-(4-methoxyphenylimino)-N-(pyridin-2-yl)-2H-chromene-3-carboxamide | CHEMBL1172665
TypeSmall organic molecule
Emp. Form.C22H17N3O4
Mol. Mass.387.3881
SMILESCOc1ccc(cc1)\N=c1/oc2cc(O)ccc2cc1C(=O)Nc1ccccn1