Reaction Details
TargetAldo-keto reductase family 1 member A1
LigandBDBM16312
Substrate/Competitorn/a
Meas. Tech.ChEMBL_640041 (CHEMBL1174255)
IC50 4600±n/a nM
Citation Endo, SMatsunaga, TKuwata, KZhao, HTEl-Kabbani, OKitade, YHara, A Chromene-3-carboxamide derivatives discovered from virtual screening as potent inhibitors of the tumour maker, AKR1B10. Bioorg Med Chem18:2485-90 (2010) 
 
Aldo-keto reductase family 1 member A1
Name:Aldo-keto reductase family 1 member A1
Type:Enzyme
Mol. Mass.:36574.11
Organism:Homo sapiens (Human)
Description:n/a
Residue:325
BDBM16312
NameBDBM16312
Synonyms:(4S)-6-fluoro-2,3-dihydrospiro[1-benzopyran-4,4'-imidazolidine]-2',5'-dione Sorbinil
TypeSmall organic molecule
Emp. Form.C11H9FN2O3
Mol. Mass.236.1992
SMILESFc1ccc2OCC[C@]3(NC(=O)NC3=O)c2c1