Reaction Details
TargetAldo-keto reductase family 1 member A1
LigandBDBM50038843
Substrate/Competitorn/a
Meas. Tech.ChEMBL_640041 (CHEMBL1174255)
IC50 6.7±n/a nM
Citation Endo, SMatsunaga, TKuwata, KZhao, HTEl-Kabbani, OKitade, YHara, A Chromene-3-carboxamide derivatives discovered from virtual screening as potent inhibitors of the tumour maker, AKR1B10. Bioorg Med Chem18:2485-90 (2010) 
 
Aldo-keto reductase family 1 member A1
Name:Aldo-keto reductase family 1 member A1
Type:Enzyme
Mol. Mass.:36574.11
Organism:Homo sapiens (Human)
Description:n/a
Residue:325
BDBM50038843
NameBDBM50038843
Synonyms:(4R)-2-(4-bromo-2-fluorobenzyl)-6-fluoro-1H,2'H,5'H-spiro[isoquinoline-4,3'-pyrrolidine]-1,2',3,5'(2H)-tetrone 2-(4-bromo-2-fluorobenzyl)-6-fluoro-1H,2'H,5'H-spiro[isoquinoline-4,3'-pyrrolidine]-1,2',3,5'(2H)-tetrone 2[4-BROMO-2-FLUOROPHENYL)METHYL]-6-FLUOROSPIRO[ISOQUINOLINE-4-(1H),3'-PYRROLIDINE]-1,2',3,5'(2H)-TETRONE minalrestat
TypeSmall organic molecule
Emp. Form.C19H11BrF2N2O4
Mol. Mass.449.202
SMILESFc1ccc2C(=O)N(Cc3ccc(Br)cc3F)C(=O)[C@]3(CC(=O)NC3=O)c2c1