Reaction Details
TargetSigma non-opioid intracellular receptor 1
LigandBDBM50321762
Substrate/Competitorn/a
Meas. Tech.ChEMBL_641177 (CHEMBL1174684)
Ki 1.50±n/a nM
Citation Oberdorf, CSchmidt, TJWünsch, B 5D-QSAR for spirocyclic sigma1 receptor ligands by Quasar receptor surface modeling. Eur J Med Chem45:3116-24 (2010) 
 
Sigma non-opioid intracellular receptor 1
Name:Sigma non-opioid intracellular receptor 1
Type:Protein
Mol. Mass.:25307.17
Organism:Cavia porcellus (Guinea pig)
Description:Q60492
Residue:223
BDBM50321762
NameBDBM50321762
Synonyms:(R)-1'-benzyl-3-methoxyspiro[isochroman-1,4'-piperidine] | CHEMBL1172290
TypeSmall organic molecule
Emp. Form.C21H25NO2
Mol. Mass.323.4287
SMILESCO[C@H]1Cc2ccccc2C2(CCN(Cc3ccccc3)CC2)O1