Reaction Details
TargetSigma non-opioid intracellular receptor 1
LigandBDBM50321758
Substrate/Competitorn/a
Meas. Tech.ChEMBL_641177 (CHEMBL1174684)
Ki 3.2±n/a nM
Citation Oberdorf, CSchmidt, TJWünsch, B 5D-QSAR for spirocyclic sigma1 receptor ligands by Quasar receptor surface modeling. Eur J Med Chem45:3116-24 (2010) 
 
Sigma non-opioid intracellular receptor 1
Name:Sigma non-opioid intracellular receptor 1
Type:Protein
Mol. Mass.:25307.17
Organism:Cavia porcellus (Guinea pig)
Description:Q60492
Residue:223
BDBM50321758
NameBDBM50321758
Synonyms:(R)-1,2'-dibenzyl-6'-methoxy-6',7'-dihydrospiro[piperidine-4,4'-thieno[3,2-c]pyran] | CHEMBL1171418
TypeSmall organic molecule
Emp. Form.C26H29NO2S
Mol. Mass.419.579
SMILESCO[C@H]1Cc2sc(Cc3ccccc3)cc2C2(CCN(Cc3ccccc3)CC2)O1