Reaction Details
TargetSigma non-opioid intracellular receptor 1
LigandBDBM50321777
Substrate/Competitorn/a
Meas. Tech.ChEMBL_641177 (CHEMBL1174684)
Ki 1.5±n/a nM
Citation Oberdorf, CSchmidt, TJWünsch, B 5D-QSAR for spirocyclic sigma1 receptor ligands by Quasar receptor surface modeling. Eur J Med Chem45:3116-24 (2010) 
 
Sigma non-opioid intracellular receptor 1
Name:Sigma non-opioid intracellular receptor 1
Type:Protein
Mol. Mass.:25307.17
Organism:Cavia porcellus (Guinea pig)
Description:Q60492
Residue:223
BDBM50321777
NameBDBM50321777
Synonyms:(R)-1'-benzyl-6-methoxy-1-phenyl-1,6-dihydrospiro[furo[3,4-c]pyrazole-4,4'-piperidine] | CHEMBL1172689
TypeSmall organic molecule
Emp. Form.C23H25N3O2
Mol. Mass.375.4635
SMILESCO[C@@H]1OC2(CCN(Cc3ccccc3)CC2)c2cnn(c12)-c1ccccc1