Reaction Details
TargetSigma non-opioid intracellular receptor 1
LigandBDBM50321802
Substrate/Competitorn/a
Meas. Tech.ChEMBL_641177 (CHEMBL1174684)
Ki 1±n/a nM
Citation Oberdorf, CSchmidt, TJWünsch, B 5D-QSAR for spirocyclic sigma1 receptor ligands by Quasar receptor surface modeling. Eur J Med Chem45:3116-24 (2010) 
 
Sigma non-opioid intracellular receptor 1
Name:Sigma non-opioid intracellular receptor 1
Type:Protein
Mol. Mass.:25307.17
Organism:Cavia porcellus (Guinea pig)
Description:Q60492
Residue:223
BDBM50321802
NameBDBM50321802
Synonyms:(R)-6'-methoxy-1-(3-methylbut-2-enyl)-6',7'-dihydrospiro[piperidine-4,4'-thieno[3,2-c]pyran] | CHEMBL1170968
TypeSmall organic molecule
Emp. Form.C17H25NO2S
Mol. Mass.307.451
SMILES[#6]-[#8]-[#6@H]-1-[#6]-c2sccc2C2([#6]-[#6]-[#7](-[#6]\[#6]=[#6](\[#6])-[#6])-[#6]-[#6]2)[#8]-1