Reaction Details
TargetCysteine protease
LigandBDBM50321811
Substrate/Competitorn/a
Meas. Tech.ChEMBL_641374 (CHEMBL1175066)
Ki 700±n/a nM
Citation Ettari, RZappalà, MMicale, NSchirmeister, TGelhaus, CLeippe, MEvers, AGrasso, S Synthesis of novel peptidomimetics as inhibitors of protozoan cysteine proteases falcipain-2 and rhodesain. Eur J Med Chem45:3228-33 (2010) 
 
Cysteine protease
Name:Cysteine protease
Synonyms:Rhodesain
Type:PROTEIN
Mol. Mass.:48425.78
Organism:Trypanosoma brucei rhodesiense
Description:ChEMBL_619861
Residue:450
BDBM50321811
NameBDBM50321811
TypeSmall organic molecule
Emp. Form.C34H32ClF3N4O6S
Mol. Mass.717.154
SMILESCC(C)(C)S[C@H]1OC(=O)C[C@@H]1NC(=O)CN1c2ccccc2C(=N[C@H](COC(=O)Nc2ccc(Cl)cc2C(F)(F)F)C1=O)c1ccccc1