Reaction Details
TargetPotassium voltage-gated channel subfamily H member 2
LigandBDBM50322371
Substrate/Competitorn/a
Meas. Tech.ChEMBL_643045 (CHEMBL1176236)
Ki 8700±n/a nM
Citation Butini, SCampiani, GFranceschini, STrotta, FKumar, VGuarino, EBorrelli, GFiorini, INovellino, EFattorusso, CPersico, MOrteca, NSandager-Nielsen, KJacobsen, TAMadsen, KScheel-Kruger, JGemma, S Discovery of bishomo(hetero)arylpiperazines as novel multifunctional ligands targeting dopamine D(3) and serotonin 5-HT(1A) and 5-HT(2A) receptors. J Med Chem53:4803-7 (2010) 
 
Potassium voltage-gated channel subfamily H member 2
Name:Potassium voltage-gated channel subfamily H member 2
Type:Multi-pass membrane protein
Mol. Mass.:126672.65
Organism:Homo sapiens (Human)
Description:Q12809
Residue:1159
BDBM50322371
NameBDBM50322371
Synonyms:1-(pyridin-2-yl)-4-(6-(4-m-tolylpiperazin-1-yl)hexyl)piperazine | CHEMBL1173018
TypeSmall organic molecule
Emp. Form.C26H39N5
Mol. Mass.421.6214
SMILESCc1cccc(c1)N1CCN(CCCCCCN2CCN(CC2)c2ccccn2)CC1