Reaction Details
TargetD(1A) dopamine receptor
LigandBDBM50130293
Substrate/Competitorn/a
Meas. Tech.ChEMBL_643050 (CHEMBL1176241)
Ki 0.8±n/a nM
Citation Butini, SCampiani, GFranceschini, STrotta, FKumar, VGuarino, EBorrelli, GFiorini, INovellino, EFattorusso, CPersico, MOrteca, NSandager-Nielsen, KJacobsen, TAMadsen, KScheel-Kruger, JGemma, S Discovery of bishomo(hetero)arylpiperazines as novel multifunctional ligands targeting dopamine D(3) and serotonin 5-HT(1A) and 5-HT(2A) receptors. J Med Chem53:4803-7 (2010) 
 
D(1A) dopamine receptor
Name:D(1A) dopamine receptor
Type:Enzyme Catalytic Domain
Mol. Mass.:49429.75
Organism:RAT
Description:P18901
Residue:446
BDBM50130293
NameBDBM50130293
Synonyms:7-{4-[4-(2,3-dichlorophenyl)piperazin-1-yl]butoxy}-3,4-dihydroquinolin-2(1H)-one CHEMBL1112 US10752588, Compound Aripiprazole US9018213, aripprazole | US9156822, Aripiprazole
TypeSmall organic molecule
Emp. Form.C23H27Cl2N3O2
Mol. Mass.448.385
SMILESClc1cccc(N2CCN(CCCCOc3ccc4CCC(=O)Nc4c3)CC2)c1Cl