Reaction Details
TargetRAC-alpha serine/threonine-protein kinase
LigandBDBM50322398
Substrate/Competitorn/a
Meas. Tech.ChEMBL_643086 (CHEMBL1176552)
IC50 3.3±n/a nM
Citation Freeman-Cook, KDAutry, CBorzillo, GGordon, DBarbacci-Tobin, EBernardo, VBriere, DClark, TCorbett, MJakubczak, JKakar, SKnauth, ELippa, BLuzzio, MJMansour, MMartinelli, GMarx, MNelson, KPandit, JRajamohan, FRobinson, SSubramanyam, CWei, LWythes, MMorris, J Design of selective, ATP-competitive inhibitors of Akt. J Med Chem53:4615-22 (2010) 
 
RAC-alpha serine/threonine-protein kinase
Name:RAC-alpha serine/threonine-protein kinase
Type:Enzyme
Mol. Mass.:55681.25
Organism:Homo sapiens (Human)
Description:P31749
Residue:480
BDBM50322398
NameBDBM50322398
Synonyms:(S)-N-((3-amino-1-(5-chloro-7H-pyrrolo[2,3-d]pyrimidin-4-yl)pyrrolidin-3-yl)methyl)-4-chlorobenzamide | CHEMBL1170445
TypeSmall organic molecule
Emp. Form.C18H18Cl2N6O
Mol. Mass.405.281
SMILESN[C@]1(CNC(=O)c2ccc(Cl)cc2)CCN(C1)c1ncnc2[nH]cc(Cl)c12