Reaction Details
TargetProstaglandin G/H synthase 1
LigandBDBM50110164
Substrate/Competitorn/a
Meas. Tech.ChEMBL_643266 (CHEMBL1177198)
IC50 50±n/a nM
Citation Hieke, MNess, JSteri, RDittrich, MGreiner, CWerz, OBaumann, KSchubert-Zsilavecz, MWeggen, SZettl, H Design, synthesis, and biological evaluation of a novel class of gamma-secretase modulators with PPARgamma activity. J Med Chem53:4691-700 (2010) 
 
Prostaglandin G/H synthase 1
Name:Prostaglandin G/H synthase 1
Type:Protein
Mol. Mass.:68868.60
Organism:Ovis aries (Sheep)
Description:n/a
Residue:600
BDBM50110164
NameBDBM50110164
Synonyms:(Z)-2-(3-(4-(methylthio)benzylidene)-6-fluoro-2-methyl-3H-inden-1-yl)acetic acid CHEMBL18797 Sulindac sulphide cid_5352624 {6-Fluoro-2-methyl-3-[1-[4-(methyl-lambda*4*-sulfanyl)-phenyl]-meth-(E)-ylidene]-3H-inden-1-yl}-acetic acid
TypeSmall organic molecule
Emp. Form.C20H17FO2S
Mol. Mass.340.411
SMILESCSc1ccc(\C=C2\C(C)=C(CC(O)=O)c3cc(F)ccc23)cc1