Reaction Details
TargetSodium-dependent noradrenaline transporter
LigandBDBM50322518
Substrate/Competitorn/a
Meas. Tech.ChEMBL_641577 (CHEMBL1176114)
IC50 114±n/a nM
Citation Lukas, RJMuresan, AZDamaj, MIBlough, BEHuang, XNavarro, HAMascarella, SWEaton, JBMarxer-Miller, SKCarroll, FI Synthesis and characterization of in vitro and in vivo profiles of hydroxybupropion analogues: aids to smoking cessation. J Med Chem53:4731-48 (2010) 
 
Sodium-dependent noradrenaline transporter
Name:Sodium-dependent noradrenaline transporter
Type:Multi-pass membrane protein
Mol. Mass.:69337.72
Organism:Homo sapiens (Human)
Description:P23975
Residue:617
BDBM50322518
NameBDBM50322518
Synonyms:(+/-)2-(3,4-Dichlorophenyl)-3,5,5-trimethylmorpholin-2-ol | CHEMBL1173428
TypeSmall organic molecule
Emp. Form.C13H17Cl2NO2
Mol. Mass.290.186
SMILESCC1NC(C)(C)COC1(O)c1ccc(Cl)c(Cl)c1