Reaction Details
TargetAcetylcholine receptor subunit alpha/beta/delta/gamma
LigandBDBM50322525
Substrate/Competitorn/a
Meas. Tech.ChEMBL_641588 (CHEMBL1176290)
IC50 96000±n/a nM
Citation Lukas, RJMuresan, AZDamaj, MIBlough, BEHuang, XNavarro, HAMascarella, SWEaton, JBMarxer-Miller, SKCarroll, FI Synthesis and characterization of in vitro and in vivo profiles of hydroxybupropion analogues: aids to smoking cessation. J Med Chem53:4731-48 (2010) 
 
Acetylcholine receptor subunit alpha/beta/delta/gamma
Name:Acetylcholine receptor subunit alpha/beta/delta/gamma
Type:n/a
Mol. Mass.:n/a
Description:ASSAY_ID of EBI is 369002
Components:This complex has 4 components.
Component 1
Name:Acetylcholine receptor subunit alpha
Synonyms:ACHA_HUMAN Acetylcholine receptor protein alpha chain CHNRA Cholinergic, Nicotinic Alpha1Beta1DeltaGamma Nicotinic acetylcholine receptor alpha-1/beta-1 Nicotinic acetylcholine receptor alpha2/beta4 n-AChR
Type:Ion channel
Mol. Mass.:54542.01
Organism:Homo sapiens (Human)
Description:n/a
Residue:482
Component 2
Name:Acetylcholine receptor subunit beta
Synonyms:ACHB_HUMAN Acetylcholine receptor subunit beta CHRNB1 | Nicotinic acetylcholine receptor alpha-1/beta-1/delta/epsilon
Type:PROTEIN
Mol. Mass.:56691.23
Organism:Homo sapiens (Human)
Description:EBI_10924
Residue:501
Component 3
Name:Acetylcholine receptor subunit gamma
Synonyms:ACHG_HUMAN Acetylcholine receptor subunit gamma Muscle-type nicotinic acetylcholine receptor
Type:PROTEIN
Mol. Mass.:57880.69
Organism:Homo sapiens (Human)
Description:EBI_11211
Residue:517
Component 4
Name:Acetylcholine receptor subunit delta
Synonyms:ACHD_HUMAN Acetylcholine receptor protein delta chain Muscle-type nicotinic acetylcholine receptor | Nicotinic acetylcholine receptor alpha-1/beta-1/delta/epsilon
Type:PROTEIN
Mol. Mass.:58894.39
Organism:Homo sapiens (Human)
Description:ChEMBL_142595
Residue:517
BDBM50322525
NameBDBM50322525
Synonyms:(2S,3S)-2-(3-Nitrophenyl)-3,5,5-trimethylmorpholin-2-ol | CHEMBL1173280
TypeSmall organic molecule
Emp. Form.C13H18N2O4
Mol. Mass.266.293
SMILESC[C@@H]1NC(C)(C)CO[C@@]1(O)c1cccc(c1)[N+]([O-])=O