Reaction Details
TargetProstaglandin G/H synthase 1
LigandBDBM23926
Substrate/Competitorn/a
Meas. Tech.ChEMBL_642024 (CHEMBL1176363)
IC50 6650±n/a nM
Citation Hoshino, JPark, EJKondratyuk, TPMarler, LPezzuto, JMvan Breemen, RBMo, SLi, YCushman, M Selective synthesis and biological evaluation of sulfate-conjugated resveratrol metabolites. J Med Chem53:5033-43 (2010) 
 
Prostaglandin G/H synthase 1
Name:Prostaglandin G/H synthase 1
Type:Protein
Mol. Mass.:68868.60
Organism:Ovis aries (Sheep)
Description:n/a
Residue:600
BDBM23926
NameBDBM23926
Synonyms:(E)-resveratrol CHEMBL165 Stilbene, 2f cid_445154 trans-resveratrol
TypeSmall organic molecule
Emp. Form.C14H12O3
Mol. Mass.228.2433
SMILESOc1ccc(\C=C\c2cc(O)cc(O)c2)cc1