Reaction Details
TargetC3a anaphylatoxin chemotactic receptor
LigandBDBM50322626
Substrate/Competitorn/a
Meas. Tech.ChEMBL_642034 (CHEMBL1176066)
EC50 950±n/a nM
Citation Scully, CCBlakeney, JSSingh, RHoang, HNAbbenante, GReid, RCFairlie, DP Selective hexapeptide agonists and antagonists for human complement C3a receptor. J Med Chem53:4938-48 (2010) 
 
C3a anaphylatoxin chemotactic receptor
Name:C3a anaphylatoxin chemotactic receptor
Type:PROTEIN
Mol. Mass.:53864.66
Organism:Homo sapiens (Human)
Description:ChEMBL_642034
Residue:482
BDBM50322626
NameBDBM50322626
Synonyms:(S)-2-((S)-2-((S)-2-((S)-1-((2S,3S)-2-((S)-2-amino-3-phenylpropanamido)-3-methylpentanoyl)pyrrolidine-2-carboxamido)-4-methylpentanamido)propanamido)-5-guanidinopentanoic acid | CHEMBL1170042
TypeSmall organic molecule
Emp. Form.C35H57N9O7
Mol. Mass.715.8832
SMILESCC[C@H](C)[C@H](NC(=O)[C@@H](N)Cc1ccccc1)C(=O)N1CCC[C@H]1C(=O)N[C@@H](CC(C)C)C(=O)N[C@@H](C)C(=O)N[C@@H](CCCNC(N)=N)C(O)=O