Reaction Details
TargetC3a anaphylatoxin chemotactic receptor
LigandBDBM50322648
Substrate/Competitorn/a
Meas. Tech.ChEMBL_642036 (CHEMBL1176068)
IC50 81±n/a nM
Citation Scully, CCBlakeney, JSSingh, RHoang, HNAbbenante, GReid, RCFairlie, DP Selective hexapeptide agonists and antagonists for human complement C3a receptor. J Med Chem53:4938-48 (2010) 
 
C3a anaphylatoxin chemotactic receptor
Name:C3a anaphylatoxin chemotactic receptor
Type:PROTEIN
Mol. Mass.:53864.66
Organism:Homo sapiens (Human)
Description:ChEMBL_642034
Residue:482
BDBM50322648
NameBDBM50322648
Synonyms:(2S,5S,8S,11S,14S,17S)-14-((1H-indol-3-yl)methyl)-17-amino-2-(3-guanidinopropyl)-11-((R)-1-hydroxyethyl)-8-isobutyl-5-methyl-4,7,10,13,16-pentaoxo-18-phenyl-3,6,9,12,15-pentaazaoctadecan-1-oic acid | CHEMBL1170637
TypeSmall organic molecule
Emp. Form.C39H56N10O8
Mol. Mass.792.9241
SMILESCC(C)C[C@H](NC(=O)[C@@H](NC(=O)[C@H](Cc1c[nH]c2ccccc12)NC(=O)[C@@H](N)Cc1ccccc1)[C@@H](C)O)C(=O)N[C@@H](C)C(=O)N[C@@H](CCCNC(N)=N)C(O)=O