Reaction Details
TargetC3a anaphylatoxin chemotactic receptor
LigandBDBM50322644
Substrate/Competitorn/a
Meas. Tech.ChEMBL_642037 (CHEMBL1176069)
EC50 310±n/a nM
Citation Scully, CCBlakeney, JSSingh, RHoang, HNAbbenante, GReid, RCFairlie, DP Selective hexapeptide agonists and antagonists for human complement C3a receptor. J Med Chem53:4938-48 (2010) 
 
C3a anaphylatoxin chemotactic receptor
Name:C3a anaphylatoxin chemotactic receptor
Type:PROTEIN
Mol. Mass.:53864.66
Organism:Homo sapiens (Human)
Description:ChEMBL_642034
Residue:482
BDBM50322644
NameBDBM50322644
Synonyms:(2S,5S,8S,11S,14S,17S)-17-amino-14-butyl-2-(3-guanidinopropyl)-11-((R)-1-hydroxyethyl)-8-isobutyl-5-methyl-4,7,10,13,16-pentaoxo-18-phenyl-3,6,9,12,15-pentaazaoctadecan-1-oic acid | CHEMBL1170437
TypeSmall organic molecule
Emp. Form.C34H57N9O8
Mol. Mass.719.8719
SMILES[#6]-[#6]-[#6]-[#6]-[#6@H](-[#7]-[#6](=O)-[#6@@H](-[#7])-[#6]-c1ccccc1)-[#6](=O)-[#7]-[#6@@H](-[#6@@H](-[#6])-[#8])-[#6](=O)-[#7]-[#6@@H](-[#6]-[#6](-[#6])-[#6])-[#6](=O)-[#7]-[#6@@H](-[#6])-[#6](=O)-[#7]-[#6@@H](-[#6]-[#6]-[#6]\[#7]=[#6](/[#7])-[#7])-[#6](-[#8])=O