Reaction Details
TargetCruzipain
LigandBDBM50322741
Substrate/Competitorn/a
Meas. Tech.ChEMBL_642347 (CHEMBL1177373)
Ki 800±n/a nM
Citation Ferreira, RSSimeonov, AJadhav, AEidam, OMott, BTKeiser, MJMcKerrow, JHMaloney, DJIrwin, JJShoichet, BK Complementarity between a docking and a high-throughput screen in discovering new cruzain inhibitors. J Med Chem53:4891-905 (2010) 
 
Cruzipain
Name:Cruzipain
Type:Protein
Mol. Mass.:49831.41
Organism:Trypanosoma cruzi
Description:P25779
Residue:467
BDBM50322741
NameBDBM50322741
Synonyms:2-(3-chloro-4-methoxyphenylamino)-2-oxoethyl 2-(1,3-dioxo-3a,4-dihydro-1H-isoindol-2(3H,7H,7aH)-yl)-4-methylpentanoate | CHEMBL1173693
TypeSmall organic molecule
Emp. Form.C23H27ClN2O6
Mol. Mass.462.923
SMILESCOc1ccc(NC(=O)COC(=O)C(CC(C)C)N2C(=O)C3CC=CCC3C2=O)cc1Cl