Reaction Details
TargetAcetylcholinesterase
LigandBDBM50322767
Substrate/Competitorn/a
Meas. Tech.ChEMBL_642381 (CHEMBL1177574)
IC50 0.5±n/a nM
Citation Fernández-Bachiller, MIPérez, CGonzález-Muñoz, GCConde, SLópez, MGVillarroya, MGarcía, AGRodríguez-Franco, MI Novel tacrine-8-hydroxyquinoline hybrids as multifunctional agents for the treatment of Alzheimer's disease, with neuroprotective, cholinergic, antioxidant, and copper-complexing properties. J Med Chem53:4927-37 (2010) 
 
Acetylcholinesterase
Name:Acetylcholinesterase
Type:Enzyme
Mol. Mass.:67792.70
Organism:Homo sapiens (Human)
Description:P22303
Residue:614
BDBM50322767
NameBDBM50322767
Synonyms:2-Methyl-7-{[8-(1,2,3,4-tetrahydroacridin-9-ylamino)octylamino]methyl}quinolin-8-ol Dihydrochloride | CHEMBL1172618
TypeSmall organic molecule
Emp. Form.C32H40N4O
Mol. Mass.496.6862
SMILESCc1ccc2ccc(CNCCCCCCCCNc3c4CCCCc4nc4ccccc34)c(O)c2n1