Reaction Details
TargetCholinesterase
LigandBDBM50322767
Substrate/Competitorn/a
Meas. Tech.ChEMBL_642382 (CHEMBL1177575)
IC50 2±n/a nM
Citation Fernández-Bachiller, MIPérez, CGonzález-Muñoz, GCConde, SLópez, MGVillarroya, MGarcía, AGRodríguez-Franco, MI Novel tacrine-8-hydroxyquinoline hybrids as multifunctional agents for the treatment of Alzheimer's disease, with neuroprotective, cholinergic, antioxidant, and copper-complexing properties. J Med Chem53:4927-37 (2010) 
 
Cholinesterase
Name:Cholinesterase
Type:Enzyme
Mol. Mass.:65643.35
Organism:Equus caballus (Horse)
Description:P81908
Residue:574
BDBM50322767
NameBDBM50322767
Synonyms:2-Methyl-7-{[8-(1,2,3,4-tetrahydroacridin-9-ylamino)octylamino]methyl}quinolin-8-ol Dihydrochloride | CHEMBL1172618
TypeSmall organic molecule
Emp. Form.C32H40N4O
Mol. Mass.496.6862
SMILESCc1ccc2ccc(CNCCCCCCCCNc3c4CCCCc4nc4ccccc34)c(O)c2n1