Reaction Details
TargetCholinesterase
LigandBDBM50322782
Substrate/Competitorn/a
Meas. Tech.ChEMBL_642382 (CHEMBL1177575)
IC50 30±n/a nM
Citation Fernández-Bachiller, MIPérez, CGonzález-Muñoz, GCConde, SLópez, MGVillarroya, MGarcía, AGRodríguez-Franco, MI Novel tacrine-8-hydroxyquinoline hybrids as multifunctional agents for the treatment of Alzheimer's disease, with neuroprotective, cholinergic, antioxidant, and copper-complexing properties. J Med Chem53:4927-37 (2010) 
 
Cholinesterase
Name:Cholinesterase
Type:Enzyme
Mol. Mass.:65643.35
Organism:Equus caballus (Horse)
Description:P81908
Residue:574
BDBM50322782
NameBDBM50322782
Synonyms:5-Chloro-7-{{3-{methyl[3-(1,2,3,4-tetrahydroacridin-9-ylamino)propyl]amino}propylamino}methyl}quinolin-8-ol Dihydrochloride | CHEMBL1173052
TypeSmall organic molecule
Emp. Form.C30H36ClN5O
Mol. Mass.518.093
SMILESCN(CCCNCc1cc(Cl)c2cccnc2c1O)CCCNc1c2CCCCc2nc2ccccc12