Reaction Details
TargetAurora kinase A
LigandBDBM50322802
Substrate/Competitorn/a
Meas. Tech.ChEMBL_642509 (CHEMBL1175882)
IC50 3311±n/a nM
Citation Coumar, MSChu, CYLin, CWShiao, HYHo, YLReddy, RLin, WHChen, CHPeng, YHLeou, JSLien, TWHuang, CTFang, MYWu, SHWu, JSChittimalla, SKSong, JSHsu, JTWu, SYLiao, CCChao, YSHsieh, HP Fast-forwarding hit to lead: aurora and epidermal growth factor receptor kinase inhibitor lead identification. J Med Chem53:4980-8 (2010) 
 
Aurora kinase A
Name:Aurora kinase A
Type:Serine/threonine-protein kinase
Mol. Mass.:45830.98
Organism:Homo sapiens (Human)
Description:O14965
Residue:403
BDBM50322802
NameBDBM50322802
Synonyms:(5,6-Diphenylfuro[2,3-d]pyrimidin-4-yl)-(3-imidazol-1-ylpropyl)-amine cid_3241232
TypeSmall organic molecule
Emp. Form.C24H21N5O
Mol. Mass.395.4564
SMILESC(CNc1ncnc2oc(c(-c3ccccc3)c12)-c1ccccc1)Cn1ccnc1