Reaction Details
TargetAurora kinase A
LigandBDBM50322816
Substrate/Competitorn/a
Meas. Tech.ChEMBL_642509 (CHEMBL1175882)
IC50 43±n/a nM
Citation Coumar, MSChu, CYLin, CWShiao, HYHo, YLReddy, RLin, WHChen, CHPeng, YHLeou, JSLien, TWHuang, CTFang, MYWu, SHWu, JSChittimalla, SKSong, JSHsu, JTWu, SYLiao, CCChao, YSHsieh, HP Fast-forwarding hit to lead: aurora and epidermal growth factor receptor kinase inhibitor lead identification. J Med Chem53:4980-8 (2010) 
 
Aurora kinase A
Name:Aurora kinase A
Type:Serine/threonine-protein kinase
Mol. Mass.:45830.98
Organism:Homo sapiens (Human)
Description:O14965
Residue:403
BDBM50322816
NameBDBM50322816
Synonyms:1-{4-[2-(5,6-Diphenylfuro[2,3-d]pyrimidin-4-ylamino)ethyl]-phenyl}-3-phenylurea | CHEMBL1173731
TypeSmall organic molecule
Emp. Form.C33H27N5O2
Mol. Mass.525.5998
SMILESO=C(Nc1ccccc1)Nc1ccc(CCNc2ncnc3oc(c(-c4ccccc4)c23)-c2ccccc2)cc1