Reaction Details
TargetAurora kinase A
LigandBDBM50322818
Substrate/Competitorn/a
Meas. Tech.ChEMBL_642509 (CHEMBL1175882)
IC50 5831±n/a nM
Citation Coumar, MSChu, CYLin, CWShiao, HYHo, YLReddy, RLin, WHChen, CHPeng, YHLeou, JSLien, TWHuang, CTFang, MYWu, SHWu, JSChittimalla, SKSong, JSHsu, JTWu, SYLiao, CCChao, YSHsieh, HP Fast-forwarding hit to lead: aurora and epidermal growth factor receptor kinase inhibitor lead identification. J Med Chem53:4980-8 (2010) 
 
Aurora kinase A
Name:Aurora kinase A
Type:Serine/threonine-protein kinase
Mol. Mass.:45830.98
Organism:Homo sapiens (Human)
Description:O14965
Residue:403
BDBM50322818
NameBDBM50322818
Synonyms:CHEMBL1173465 | N-{4-[2-(5,6-Diphenylfuro[2,3-d]pyrimidin-4-ylamino)ethyl]-phenyl}benzenesulfonamide
TypeSmall organic molecule
Emp. Form.C32H26N4O3S
Mol. Mass.546.639
SMILESO=S(=O)(Nc1ccc(CCNc2ncnc3oc(c(-c4ccccc4)c23)-c2ccccc2)cc1)c1ccccc1