Reaction Details
TargetEpidermal growth factor receptor
LigandBDBM50322821
Substrate/Competitorn/a
Meas. Tech.ChEMBL_642516 (CHEMBL1176122)
IC50 82±n/a nM
Citation Coumar, MSChu, CYLin, CWShiao, HYHo, YLReddy, RLin, WHChen, CHPeng, YHLeou, JSLien, TWHuang, CTFang, MYWu, SHWu, JSChittimalla, SKSong, JSHsu, JTWu, SYLiao, CCChao, YSHsieh, HP Fast-forwarding hit to lead: aurora and epidermal growth factor receptor kinase inhibitor lead identification. J Med Chem53:4980-8 (2010) 
 
Epidermal growth factor receptor
Name:Epidermal growth factor receptor
Type:Receptor Kinase Domain
Mol. Mass.:134279.59
Organism:Homo sapiens (Human)
Description:P00533
Residue:1210
BDBM50322821
NameBDBM50322821
Synonyms:(S)-N-(4-(4-(2-hydroxy-1-phenylethylamino)-6-phenylfuro[2,3-d]pyrimidin-5-yl)phenyl)acrylamide | CHEMBL1172773
TypeSmall organic molecule
Emp. Form.C29H24N4O3
Mol. Mass.476.5259
SMILESOC[C@@H](Nc1ncnc2oc(c(-c3ccc(NC(=O)C=C)cc3)c12)-c1ccccc1)c1ccccc1