Reaction Details
TargetNeuropeptide S receptor
LigandBDBM50322832
Substrate/Competitorn/a
Meas. Tech.ChEMBL_644490 (CHEMBL1211328)
IC50 725±n/a nM
Citation Melamed, JYZartman, AEKett, NRGotter, ALUebele, VNReiss, DRCondra, CLFandozzi, CLubbers, LSRowe, BAMcGaughey, GBHenault, MStocco, RRenger, JJHartman, GDBilodeau, MTTrotter, BW Synthesis and evaluation of a new series of Neuropeptide S receptor antagonists. Bioorg Med Chem Lett20:4700-3 (2010) 
 
Neuropeptide S receptor
Name:Neuropeptide S receptor
Type:PROTEIN
Mol. Mass.:42692.30
Organism:Homo sapiens (Human)
Description:ChEMBL_1276607
Residue:371
BDBM50322832
NameBDBM50322832
Synonyms:CHEMBL1210179 | N-((1-methyl-2-oxo-1,2-dihydroquinolin-3-yl)methyl)-N-(4-morpholinobutan-2-yl)cyclohexanecarboxamide
TypeSmall organic molecule
Emp. Form.C26H37N3O3
Mol. Mass.439.5903
SMILESCC(CCN1CCOCC1)N(Cc1cc2ccccc2n(C)c1=O)C(=O)C1CCCCC1