Reaction Details
TargetAdenosine receptor A1
LigandBDBM50229885
Substrate/Competitorn/a
Meas. Tech.ChEMBL_644537 (CHEMBL1211414)
Ki 200±n/a nM
Citation Cheng, FXu, ZLiu, GTang, Y Insights into binding modes of adenosine A(2B) antagonists with ligand-based and receptor-based methods. Eur J Med Chem45:3459-71 (2010) 
 
Adenosine receptor A1
Name:Adenosine receptor A1
Type:G Protein-Coupled Receptor (GPCR)
Mol. Mass.:36520.92
Organism:Homo sapiens (Human)
Description:P30542
Residue:326
BDBM50229885
NameBDBM50229885
Synonyms:CHEMBL260331 N-(benzo[d][1,3]dioxol-5-yl)-2-(5-(2,6-dioxo-1,3-dipropyl-2,3,6,7-tetrahydro-1H-purin-8-yl)-1-methyl-1H-pyrazol-3-yloxy)acetamide | N-Benzo[1,3]dioxol-5-yl-2-[5-(2,6-dioxo-1,3-dipropyl-2,3,6,7-tetrahydro-1H-purin-8-yl)-1-methyl-1H-pyrazol-3-yloxy]-acetamide
TypeSmall organic molecule
Emp. Form.C24H27N7O6
Mol. Mass.509.5145
SMILESCCCn1c2nc([nH]c2c(=O)n(CCC)c1=O)-c1cc(OCC(=O)Nc2ccc3OCOc3c2)nn1C