Reaction Details
TargetAdenosine receptor A3
LigandBDBM50322843
Substrate/Competitorn/a
Meas. Tech.ChEMBL_644538 (CHEMBL1211415)
Ki 326±n/a nM
Citation Cheng, FXu, ZLiu, GTang, Y Insights into binding modes of adenosine A(2B) antagonists with ligand-based and receptor-based methods. Eur J Med Chem45:3459-71 (2010) 
 
Adenosine receptor A3
Name:Adenosine receptor A3
Type:G Protein-Coupled Receptor (GPCR)
Mol. Mass.:36197.32
Organism:Homo sapiens (Human)
Description:P0DMS8
Residue:318
BDBM50322843
NameBDBM50322843
Synonyms:1-(cyclopropylmethyl)-3-ethyl-8-(1-(3-(trifluoromethyl)benzyl)-1H-pyrazol-4-yl)-1H-purine-2,6(3H,7H)-dione CHEMBL411452
TypeSmall organic molecule
Emp. Form.C22H21F3N6O2
Mol. Mass.458.4363
SMILESCCn1c2nc([nH]c2c(=O)n(CC2CC2)c1=O)-c1cnn(Cc2cccc(c2)C(F)(F)F)c1