Reaction Details
TargetAdenosine receptor A2b
LigandBDBM50322844
Substrate/Competitorn/a
Meas. Tech.ChEMBL_644535 (CHEMBL1211412)
Ki 49±n/a nM
Citation Cheng, FXu, ZLiu, GTang, Y Insights into binding modes of adenosine A(2B) antagonists with ligand-based and receptor-based methods. Eur J Med Chem45:3459-71 (2010) 
 
Adenosine receptor A2b
Name:Adenosine receptor A2b
Type:G Protein-Coupled Receptor (GPCR)
Mol. Mass.:36341.22
Organism:Homo sapiens (Human)
Description:n/a
Residue:332
BDBM50322844
NameBDBM50322844
Synonyms:3-ethyl-1-propyl-8-(1H-pyrazol-4-yl)-1H-purine-2,6(3H,7H)-dione | CHEMBL405901
TypeSmall organic molecule
Emp. Form.C13H16N6O2
Mol. Mass.288.3051
SMILESCCCn1c(=O)n(CC)c2nc([nH]c2c1=O)-c1cn[nH]c1