Reaction Details
TargetAdenosine receptor A1
LigandBDBM50322844
Substrate/Competitorn/a
Meas. Tech.ChEMBL_644537 (CHEMBL1211414)
Ki 178±n/a nM
Citation Cheng, FXu, ZLiu, GTang, Y Insights into binding modes of adenosine A(2B) antagonists with ligand-based and receptor-based methods. Eur J Med Chem45:3459-71 (2010) 
 
Adenosine receptor A1
Name:Adenosine receptor A1
Type:G Protein-Coupled Receptor (GPCR)
Mol. Mass.:36520.92
Organism:Homo sapiens (Human)
Description:P30542
Residue:326
BDBM50322844
NameBDBM50322844
Synonyms:3-ethyl-1-propyl-8-(1H-pyrazol-4-yl)-1H-purine-2,6(3H,7H)-dione | CHEMBL405901
TypeSmall organic molecule
Emp. Form.C13H16N6O2
Mol. Mass.288.3051
SMILESCCCn1c(=O)n(CC)c2nc([nH]c2c1=O)-c1cn[nH]c1