Reaction Details
TargetAdenosine receptor A3
LigandBDBM50188569
Substrate/Competitorn/a
Meas. Tech.ChEMBL_644538 (CHEMBL1211415)
Ki 54±n/a nM
Citation Cheng, FXu, ZLiu, GTang, Y Insights into binding modes of adenosine A(2B) antagonists with ligand-based and receptor-based methods. Eur J Med Chem45:3459-71 (2010) 
 
Adenosine receptor A3
Name:Adenosine receptor A3
Type:G Protein-Coupled Receptor (GPCR)
Mol. Mass.:36197.32
Organism:Homo sapiens (Human)
Description:P0DMS8
Residue:318
BDBM50188569
NameBDBM50188569
Synonyms:8-(1-(2-chloro-5-(trifluoromethyl)benzyl)-1H-pyrazol-4-yl)-1,3-dipropyl-1H-purine-2,6(3H,7H)-dione | CHEMBL378598
TypeSmall organic molecule
Emp. Form.C22H22ClF3N6O2
Mol. Mass.494.897
SMILESCCCn1c2nc([nH]c2c(=O)n(CCC)c1=O)-c1cnn(Cc2cc(ccc2Cl)C(F)(F)F)c1