Reaction Details
TargetAdenosine receptor A2b
LigandBDBM50020965
Substrate/Competitorn/a
Meas. Tech.ChEMBL_644535 (CHEMBL1211412)
Ki 394±n/a nM
Citation Cheng, FXu, ZLiu, GTang, Y Insights into binding modes of adenosine A(2B) antagonists with ligand-based and receptor-based methods. Eur J Med Chem45:3459-71 (2010) 
 
Adenosine receptor A2b
Name:Adenosine receptor A2b
Type:G Protein-Coupled Receptor (GPCR)
Mol. Mass.:36341.22
Organism:Homo sapiens (Human)
Description:n/a
Residue:332
BDBM50020965
NameBDBM50020965
Synonyms:8-(4-Methoxy-phenyl)-1,3-dimethyl-3,7-dihydro-purine-2,6-dione 8-(4-methoxyphenyl)-1,3-dimethyl-1H-purine-2,6(3H,7H)-dione | CHEMBL11635
TypeSmall organic molecule
Emp. Form.C14H14N4O3
Mol. Mass.286.286
SMILESCOc1ccc(cc1)-c1nc2n(C)c(=O)n(C)c(=O)c2[nH]1