Reaction Details
TargetAdenosine receptor A2a
LigandBDBM50254006
Substrate/Competitorn/a
Meas. Tech.ChEMBL_644536 (CHEMBL1211413)
Ki 73±n/a nM
Citation Cheng, FXu, ZLiu, GTang, Y Insights into binding modes of adenosine A(2B) antagonists with ligand-based and receptor-based methods. Eur J Med Chem45:3459-71 (2010) 
 
Adenosine receptor A2a
Name:Adenosine receptor A2a
Type:G Protein-Coupled Receptor (GPCR)
Mol. Mass.:44716.46
Organism:Homo sapiens (Human)
Description:P29274
Residue:412
BDBM50254006
NameBDBM50254006
Synonyms:3-(4-Cyanobenzyl)-7-(2-furyl)-3H-[1,2,3]triazolo[4,5-d]pyrimidine-5-amine CHEMBL461007
TypeSmall organic molecule
Emp. Form.C16H11N7O
Mol. Mass.317.3048
SMILESNc1nc(-c2ccco2)c2nnn(Cc3ccc(cc3)C#N)c2n1