Reaction Details
TargetAdenosine receptor A2b
LigandBDBM50190708
Substrate/Competitorn/a
Meas. Tech.ChEMBL_644535 (CHEMBL1211412)
Ki 154±n/a nM
Citation Cheng, FXu, ZLiu, GTang, Y Insights into binding modes of adenosine A(2B) antagonists with ligand-based and receptor-based methods. Eur J Med Chem45:3459-71 (2010) 
 
Adenosine receptor A2b
Name:Adenosine receptor A2b
Type:G Protein-Coupled Receptor (GPCR)
Mol. Mass.:36341.22
Organism:Homo sapiens (Human)
Description:n/a
Residue:332
BDBM50190708
NameBDBM50190708
Synonyms:2-(4-(1,3-dimethyl-2,6-dioxo-2,3,6,7-tetrahydro-1H-purin-8-yl)phenylsulfonamido)acetic acid CHEMBL213878
TypeSmall organic molecule
Emp. Form.C15H15N5O6S
Mol. Mass.393.375
SMILESCn1c2nc([nH]c2c(=O)n(C)c1=O)-c1ccc(cc1)S(=O)(=O)NCC(O)=O