Reaction Details
TargetB1 bradykinin receptor
LigandBDBM50322855
Substrate/Competitorn/a
Meas. Tech.ChEMBL_644658 (CHEMBL1211637)
Ki 34±n/a nM
Citation Liu, QQian, WLi, ABiswas, KChen, JJFotsch, CHan, NYuan, CArik, LBiddlecome, GJohnson, EKumar, GLester-Zeiner, DNg, GYHungate, RWAskew, BC Aryl sulfonamides containing tetralin allylic amines as potent and selective bradykinin B1 receptor antagonists. Bioorg Med Chem Lett20:4593-7 (2010) 
 
B1 bradykinin receptor
Name:B1 bradykinin receptor
Type:Enzyme
Mol. Mass.:40508.87
Organism:Homo sapiens (Human)
Description:P46663
Residue:353
BDBM50322855
NameBDBM50322855
Synonyms:(3R)-3-phenyl-N-((1R)-6-(1-(piperidin-1-yl)propan-2-yl)-1,2,3,4-tetrahydronaphthalen-1-yl)-3-(3-(trifluoromethyl)phenylsulfonamido)propanamide | CHEMBL1210741
TypeSmall organic molecule
Emp. Form.C34H40F3N3O3S
Mol. Mass.627.76
SMILESCC(CN1CCCCC1)c1ccc2[C@@H](CCCc2c1)NC(=O)C[C@@H](NS(=O)(=O)c1cccc(c1)C(F)(F)F)c1ccccc1