Reaction Details
TargetB1 bradykinin receptor
LigandBDBM50322869
Substrate/Competitorn/a
Meas. Tech.ChEMBL_644658 (CHEMBL1211637)
Ki 30±n/a nM
Citation Liu, QQian, WLi, ABiswas, KChen, JJFotsch, CHan, NYuan, CArik, LBiddlecome, GJohnson, EKumar, GLester-Zeiner, DNg, GYHungate, RWAskew, BC Aryl sulfonamides containing tetralin allylic amines as potent and selective bradykinin B1 receptor antagonists. Bioorg Med Chem Lett20:4593-7 (2010) 
 
B1 bradykinin receptor
Name:B1 bradykinin receptor
Type:Enzyme
Mol. Mass.:40508.87
Organism:Homo sapiens (Human)
Description:P46663
Residue:353
BDBM50322869
NameBDBM50322869
Synonyms:(R)-N-((R)-6-(3-(cyclopentylamino)prop-1-en-2-yl)-1,2,3,4-tetrahydronaphthalen-1-yl)-3-phenyl-3-(3-(trifluoromethyl)phenylsulfonamido)propanamide | CHEMBL1210755
TypeSmall organic molecule
Emp. Form.C34H38F3N3O3S
Mol. Mass.625.744
SMILESFC(F)(F)c1cccc(c1)S(=O)(=O)N[C@H](CC(=O)N[C@@H]1CCCc2cc(ccc12)C(=C)CNC1CCCC1)c1ccccc1