Reaction Details
TargetVoltage-dependent T-type calcium channel subunit alpha-1H
LigandBDBM50322937
Substrate/Competitorn/a
Meas. Tech.ChEMBL_643451 (CHEMBL1212315)
IC50 60±n/a nM
Citation Smith, EMSorota, SKim, HMMcKittrick, BANechuta, TLBennett, CKnutson, CBurnett, DAKieselgof, JTan, ZRindgen, DBridal, TZhou, XJia, YPDong, ZMullins, DZhang, XPriestley, TCorrell, CCTulshian, DCzarniecki, MGreenlee, WJ T-type calcium channel blockers: spiro-piperidine azetidines and azetidinones-optimization, design and synthesis. Bioorg Med Chem Lett20:4602-6 (2010) 
 
Voltage-dependent T-type calcium channel subunit alpha-1H
Name:Voltage-dependent T-type calcium channel subunit alpha-1H
Type:Enzyme Catalytic Domain
Mol. Mass.:259187.68
Organism:Homo sapiens (Human)
Description:Calcium channel (Type T,L) 0 0::O95180
Residue:2353
BDBM50322937
NameBDBM50322937
Synonyms:2-(3-chloro-4-fluorophenyl)-N-(3,5-difluorophenyl)-1-(pyridin-2-yl)-2,7-diazaspiro[3.5]nonane-7-carboxamide | CHEMBL1210564
TypeSmall organic molecule
Emp. Form.C25H22ClF3N4O
Mol. Mass.486.917
SMILESFc1cc(F)cc(NC(=O)N2CCC3(CN(C3c3ccccn3)c3ccc(F)c(Cl)c3)CC2)c1