Reaction Details
TargetVoltage-dependent T-type calcium channel subunit alpha-1H
LigandBDBM50322940
Substrate/Competitorn/a
Meas. Tech.ChEMBL_643451 (CHEMBL1212315)
IC50 17±n/a nM
Citation Smith, EMSorota, SKim, HMMcKittrick, BANechuta, TLBennett, CKnutson, CBurnett, DAKieselgof, JTan, ZRindgen, DBridal, TZhou, XJia, YPDong, ZMullins, DZhang, XPriestley, TCorrell, CCTulshian, DCzarniecki, MGreenlee, WJ T-type calcium channel blockers: spiro-piperidine azetidines and azetidinones-optimization, design and synthesis. Bioorg Med Chem Lett20:4602-6 (2010) 
 
Voltage-dependent T-type calcium channel subunit alpha-1H
Name:Voltage-dependent T-type calcium channel subunit alpha-1H
Type:Enzyme Catalytic Domain
Mol. Mass.:259187.68
Organism:Homo sapiens (Human)
Description:Calcium channel (Type T,L) 0 0::O95180
Residue:2353
BDBM50322940
NameBDBM50322940
Synonyms:2-(3,4-difluorophenyl)-1-oxo-3-(pyridin-2-yl)-N-(3-(trifluoromethyl)phenyl)-2,7-diazaspiro[3.5]nonane-7-carboxamide | CHEMBL1210629
TypeSmall organic molecule
Emp. Form.C26H21F5N4O2
Mol. Mass.516.4626
SMILESFc1ccc(cc1F)N1C(c2ccccn2)C2(CCN(CC2)C(=O)Nc2cccc(c2)C(F)(F)F)C1=O