Reaction Details
TargetSomatostatin receptor type 5
LigandBDBM50322973
Substrate/Competitorn/a
Meas. Tech.ChEMBL_643471 (CHEMBL1212335)
Ki 25±n/a nM
Citation Alker, ABinggeli, AChrist, ADGreen, LMaerki, HPMartin, REMohr, P Piperidinyl-nicotinamides as potent and selective somatostatin receptor subtype 5 antagonists. Bioorg Med Chem Lett20:4521-5 (2010) 
 
Somatostatin receptor type 5
Name:Somatostatin receptor type 5
Type:Enzyme
Mol. Mass.:39218.02
Organism:Homo sapiens (Human)
Description:P35346
Residue:364
BDBM50322973
NameBDBM50322973
Synonyms:CHEMBL1210373 | N-(1-(3,5-diethoxy-4-fluorobenzyl)piperidin-4-yl)-5-methylnicotinamide
TypeSmall organic molecule
Emp. Form.C23H30FN3O3
Mol. Mass.415.501
SMILESCCOc1cc(CN2CCC(CC2)NC(=O)c2cncc(C)c2)cc(OCC)c1F