Reaction Details
TargetSomatostatin receptor type 5
LigandBDBM50227129
Substrate/Competitorn/a
Meas. Tech.ChEMBL_643471 (CHEMBL1212335)
Ki 15±n/a nM
Citation Alker, ABinggeli, AChrist, ADGreen, LMaerki, HPMartin, REMohr, P Piperidinyl-nicotinamides as potent and selective somatostatin receptor subtype 5 antagonists. Bioorg Med Chem Lett20:4521-5 (2010) 
 
Somatostatin receptor type 5
Name:Somatostatin receptor type 5
Type:Enzyme
Mol. Mass.:39218.02
Organism:Homo sapiens (Human)
Description:P35346
Residue:364
BDBM50227129
NameBDBM50227129
Synonyms:CHEMBL241329 | N-(1-(4-chloro-3-ethoxybenzyl)piperidin-4-yl)-5-methylnicotinamide
TypeSmall organic molecule
Emp. Form.C21H26ClN3O2
Mol. Mass.387.903
SMILESCCOc1cc(CN2CCC(CC2)NC(=O)c2cncc(C)c2)ccc1Cl