Reaction Details
TargetSomatostatin receptor type 5
LigandBDBM50322992
Substrate/Competitorn/a
Meas. Tech.ChEMBL_643471 (CHEMBL1212335)
Ki 4.9±n/a nM
Citation Alker, ABinggeli, AChrist, ADGreen, LMaerki, HPMartin, REMohr, P Piperidinyl-nicotinamides as potent and selective somatostatin receptor subtype 5 antagonists. Bioorg Med Chem Lett20:4521-5 (2010) 
 
Somatostatin receptor type 5
Name:Somatostatin receptor type 5
Type:Enzyme
Mol. Mass.:39218.02
Organism:Homo sapiens (Human)
Description:P35346
Residue:364
BDBM50322992
NameBDBM50322992
Synonyms:CHEMBL1210030 | N-(1-((2-ethoxy-4'-fluorobiphenyl-4-yl)methyl)piperidin-4-yl)-5-methylnicotinamide
TypeSmall organic molecule
Emp. Form.C27H30FN3O2
Mol. Mass.447.5444
SMILESCCOc1cc(CN2CCC(CC2)NC(=O)c2cncc(C)c2)ccc1-c1ccc(F)cc1