Reaction Details
Target5-hydroxytryptamine receptor 1B
LigandBDBM50323040
Substrate/Competitorn/a
Meas. Tech.ChEMBL_643633 (CHEMBL1212497)
IC50>10000±n/a nM
Citation Gattinoni, SSimone, CDDallavalle, SFezza, FNannei, RBattista, NMinetti, PQuattrociocchi, GCaprioli, ABorsini, FCabri, WPenco, SMerlini, LMaccarrone, M A new group of oxime carbamates as reversible inhibitors of fatty acid amide hydrolase. Bioorg Med Chem Lett20:4406-11 (2010) 
 
5-hydroxytryptamine receptor 1B
Name:5-hydroxytryptamine receptor 1B
Type:Protein
Mol. Mass.:43173.33
Organism:Rattus norvegicus (Rat)
Description:P28564
Residue:386
BDBM50323040
NameBDBM50323040
Synonyms:1-(3-Thiophen-2-yl-phenyl)-ethanone, O-(phenylaminocarbonyl)oxime | CHEMBL1210154
TypeSmall organic molecule
Emp. Form.C19H16N2O2S
Mol. Mass.336.408
SMILESCC(=NOC(=O)Nc1ccccc1)c1cccc(c1)-c1cccs1